{"text_format":"1","workbook":"xlsx","n_sheets":2,"sheets":["ADI","Ark1"],"not_rendered":{"charts":0,"images":0,"macros":1,"external_links":0,"defined_names":9,"comments":1,"pivot_tables":0},"unopened":[],"bounds":{"document_bytes":16777216,"sheet_cells":100000,"rows_first":2000,"rows_last":500,"rows_between":2000,"halvings":0,"cell_chars":16384,"cell_head_chars":4096},"cells_cut":0,"cells_raw":0,"read":"whole","date_system":"1900"}

{"sheet":"ADI","index":0,"n_rows":4542,"n_cols":36,"rows_kept":4542,"cut":false,"hidden":false,"merged":[[0,13,0,14],[0,9,1,9],[3,0,3,1],[3,2,3,3],[0,0,0,1],[0,2,0,3],[1,0,1,1],[1,2,1,3],[2,0,2,1],[2,2,2,3],[0,4,2,7],[3,6,3,8]]}
["Valuta",null,"DKK",null,"Regnskabsdato skal være en dato i den periode hvor ADI arket ønskes indlæst.                    Format dd-md-åå eks. 31-01-2023 ",null,null,null,null,"Sum Debet og sum Kredit skal være det samme","Sum Debet",{"$f":"SUM(H7:H4007)","v":0},null,"Version 8",null,null,null,null,"saldo","2.1/4.1","Interne Projektkonteringer",{"$f":"AB5+AG5","v":0},{"$f":"IF(V1=0,\"\",_xlfn.CONCAT(T1,\" \",U1))","v":""},null,null," "]
["Regnskabsdato",null,"2024-06-30",null,null,null,null,null,null,null,"Sum Kredit",{"$f":"SUM(I7:I4007)","v":0},{"$f":"IF(ROUND(SumDebet,2)-ROUND(SumKredit,2)=0,\"\",\"Stemmer ikke\")","v":""},null,null,null,null,null,"saldo","2.2/4.2","Interne Bidrag",{"$f":"AC5+AH5","v":0},{"$f":"IF(V2=0,\"\",_xlfn.CONCAT(T2,\" \",U2))","v":""},null,null," "]
["Kategori",null,"ADI-Finans",null,null,null,null,null,null,null,null,null,null,null,null,null,null,null,"saldo","2.3/4.3","Bidrag Fak/Inst",{"$f":"AD5+AI5","v":0},"",null,null," ","debet",{"$f":"SUMIF(AB7:AB4536,\"2.1\",$H7:$H4536)","v":0},{"$f":"SUMIF(AC7:AC4536,\"2.2\",$H7:$H4536)","v":0},{"$f":"SUMIF(AD7:AD4536,\"2.3\",$H7:$H4536)","v":0},{"$f":"SUMIF(AE7:AE4536,\"2.4\",$H7:$H4536)","v":0},{"$f":"SUMIF(AF7:AF4536,\"2.5\",$H7:$H4536)","v":0},{"$f":"SUMIF(AG7:AG4536,\"4.1\",$H7:$H4536)","v":0},{"$f":"SUMIF(AH7:AH4536,\"4.2\",$H7:$H4536)","v":0},{"$f":"SUMIF(AI7:AI4536,\"4.3\",$H7:$H4536)","v":0},{"$f":"SUMIF(AJ7:AJ4536,\"4.4\",$H7:$H4536)","v":0}]
["ØA's bilagsnummer",null,null,null,null,null,{"$f":"IF(COUNTIFS(H7:I5000,\"<0\")>0,\"Forkert fortegn i debet/kredit\",\"\")","v":""},null,null,null,null,null,null,null,null,null,null,null,"saldo","2.4/4.4","Intern Handel",{"$f":"AE5+AJ5","v":0},"",null,null," ","kredit",{"$f":"SUMIF(AB7:AB4536,\"2.1\",$I7:$I4536)","v":0},{"$f":"SUMIF(AC7:AC4536,\"2.2\",$I7:$I4536)","v":0},{"$f":"SUMIF(AD7:AD4536,\"2.3\",$I7:$I4536)","v":0},{"$f":"SUMIF(AE7:AE4536,\"2.4\",$I7:$I4536)","v":0},{"$f":"SUMIF(AF7:AF4536,\"2.5\",$I7:$I4536)","v":0},{"$f":"SUMIF(AG7:AG4536,\"4.1\",$I7:$I4536)","v":0},{"$f":"SUMIF(AH7:AH4536,\"4.2\",$I7:$I4536)","v":0},{"$f":"SUMIF(AI7:AI4536,\"4.3\",$I7:$I4536)","v":0},{"$f":"SUMIF(AJ7:AJ4536,\"4.4\",$I7:$I4536)","v":0}]
[" "," "," "," "," "," "," ","Beløb må maks indeholde to decimaler","Der må kun være et beløb i enten Debet eller Kredit"," ",null,null,null,null,null,null,null,null,"saldo","2.5","Internt Institut",{"$f":"AF5","v":0},"",null,null," ","i alt",{"$f":"AB3-AB4","v":0},{"$f":"AC3-AC4","v":0},0,0,0,0,0,0,0]
["UK","Artskt","Omkst","Proj","Stedkode","Form","Anlnr","Debet","Kredit","Linjebeskrivelse",null,null,"Kontostreng længde OK","Debet/kredit OK",null,null,null,null,null,null,null,null,{"$f":"_xlfn.CONCAT(W1:W5)","v":""},null,null,null,null,{"$f":"'Ark1'!B1","v":"2.1 Interne Projektindtægter"},{"$f":"'Ark1'!D1","v":"2.2 Interne Bidrag"},{"$f":"'Ark1'!F1","v":"2.3 Bidrag Fak/inst"},{"$f":"'Ark1'!H1","v":"2.4 Intern Handel"},{"$f":"'Ark1'!J1","v":"2.5 Internt Institut"},{"$f":"'Ark1'!L1","v":"4.1 Interne Projektomkostninger"},{"$f":"'Ark1'!N1","v":"4.2 Interne Bidrag"},{"$f":"'Ark1'!P1","v":"4.3 Bidrag Fak/Inst"},{"$f":"'Ark1'!R1","v":"4.4 Intern Handel"}]
[null,null,null,null,null,null,null,null,null,null,null,null,{"$f":"IF(LEN(A7)+LEN(B7)+LEN(C7)+LEN(D7)+LEN(E7)+LEN(F7)+LEN(G7)=0,\"\",IF(LEN(A7)+LEN(B7)+LEN(C7)+LEN(D7)+LEN(E7)+LEN(F7)+LEN(G7)=30,\"OK\",\"FEJL, du mangler at udfylde en del af kontstrengen\"))","v":""},{"$f":"S7","v":""},{"$f":"LEN(H7)","v":0},{"$f":"LEN(I7)","v":0},{"$f":"IF(O7>0,IF(P7>0,\"1\",\"0\"),\"0\")","v":"0"},{"$f":"IF(P7>0,IF(O7>0,\"1\",\"0\"),\"0\")","v":"0"},{"$f":"IF(Q7+R7=0,\"\",\"Der er tegn i både debet og kredit\")","v":""},null,null,null,null,null,null,null,null,{"$f":"_xlfn.XLOOKUP(_xlfn.NUMBERVALUE($B7),'Ark1'!B:B,'Ark1'!A:A,\"\",0,)","v":""},{"$f":"_xlfn.XLOOKUP(_xlfn.NUMBERVALUE($B7),'Ark1'!D:D,'Ark1'!C:C,\"\",0,)","v":""},{"$f":"_xlfn.XLOOKUP(_xlfn.NUMBERVALUE($B7),'Ark1'!F:F,'Ark1'!E:E,\"\",0,)","v":""},{"$f":"_xlfn.XLOOKUP(_xlfn.NUMBERVALUE($B7),'Ark1'!H:H,'Ark1'!G:G,\"\",0,)","v":""},{"$f":"_xlfn.XLOOKUP(_xlfn.NUMBERVALUE($B7),'Ark1'!J:J,'Ark1'!I:I,\"\",0,)","v":""},{"$f":"_xlfn.XLOOKUP(_xlfn.NUMBERVALUE($B7),'Ark1'!L:L,'Ark1'!K:K,\"\",0,)","v":""},{"$f":"_xlfn.XLOOKUP(_xlfn.NUMBERVALUE($B7),'Ark1'!N:N,'Ark1'!M:M,\"\",0,)","v":""},{"$f":"_xlfn.XLOOKUP(_xlfn.NUMBERVALUE($B7),'Ark1'!P:P,'Ark1'!O:O,\"\",0,)","v":""},{"$f":"_xlfn.XLOOKUP(_xlfn.NUMBERVALUE($B7),'Ark1'!R:R,'Ark1'!Q:Q,\"\",0,)","v":""}]
[null,null,null,null,null,null,null,null,null,null,null,null,{"$f":"IF(LEN(A8)+LEN(B8)+LEN(C8)+LEN(D8)+LEN(E8)+LEN(F8)+LEN(G8)=0,\"\",IF(LEN(A8)+LEN(B8)+LEN(C8)+LEN(D8)+LEN(E8)+LEN(F8)+LEN(G8)=30,\"OK\",\"FEJL, du mangler at udfylde en del af kontstrengen\"))","v":""},"",0,0,{"$f":"IF(O8>0,IF(P8>0,\"1\",\"0\"),\"0\")","v":"0"},{"$f":"IF(P8>0,IF(O8>0,\"1\",\"0\"),\"0\")","v":"0"},"",null,null,null,null,null,null,null,null,{"$f":"_xlfn.XLOOKUP(_xlfn.NUMBERVALUE($B8),'Ark1'!B:B,'Ark1'!A:A,\"\",0,)","v":""},{"$f":"_xlfn.XLOOKUP(_xlfn.NUMBERVALUE($B8),'Ark1'!D:D,'Ark1'!C:C,\"\",0,)","v":""},{"$f":"_xlfn.XLOOKUP(_xlfn.NUMBERVALUE($B8),'Ark1'!F:F,'Ark1'!E:E,\"\",0,)","v":""},{"$f":"_xlfn.XLOOKUP(_xlfn.NUMBERVALUE($B8),'Ark1'!H:H,'Ark1'!G:G,\"\",0,)","v":""},{"$f":"_xlfn.XLOOKUP(_xlfn.NUMBERVALUE($B8),'Ark1'!J:J,'Ark1'!I:I,\"\",0,)","v":""},{"$f":"_xlfn.XLOOKUP(_xlfn.NUMBERVALUE($B8),'Ark1'!L:L,'Ark1'!K:K,\"\",0,)","v":""},{"$f":"_xlfn.XLOOKUP(_xlfn.NUMBERVALUE($B8),'Ark1'!N:N,'Ark1'!M:M,\"\",0,)","v":""},{"$f":"_xlfn.XLOOKUP(_xlfn.NUMBERVALUE($B8),'Ark1'!P:P,'Ark1'!O:O,\"\",0,)","v":""},{"$f":"_xlfn.XLOOKUP(_xlfn.NUMBERVALUE($B8),'Ark1'!R:R,'Ark1'!Q:Q,\"\",0,)","v":""}]
[null,null,null,null,null,null,null,null,null,null,null,null,"","",0,0,"0","0","",null,null,null,null,null,null,null,null,{"$f":"_xlfn.XLOOKUP(_xlfn.NUMBERVALUE($B9),'Ark1'!B:B,'Ark1'!A:A,\"\",0,)","v":""},{"$f":"_xlfn.XLOOKUP(_xlfn.NUMBERVALUE($B9),'Ark1'!D:D,'Ark1'!C:C,\"\",0,)","v":""},{"$f":"_xlfn.XLOOKUP(_xlfn.NUMBERVALUE($B9),'Ark1'!F:F,'Ark1'!E:E,\"\",0,)","v":""},{"$f":"_xlfn.XLOOKUP(_xlfn.NUMBERVALUE($B9),'Ark1'!H:H,'Ark1'!G:G,\"\",0,)","v":""},{"$f":"_xlfn.XLOOKUP(_xlfn.NUMBERVALUE($B9),'Ark1'!J:J,'Ark1'!I:I,\"\",0,)","v":""},{"$f":"_xlfn.XLOOKUP(_xlfn.NUMBERVALUE($B9),'Ark1'!L:L,'Ark1'!K:K,\"\",0,)","v":""},{"$f":"_xlfn.XLOOKUP(_xlfn.NUMBERVALUE($B9),'Ark1'!N:N,'Ark1'!M:M,\"\",0,)","v":""},{"$f":"_xlfn.XLOOKUP(_xlfn.NUMBERVALUE($B9),'Ark1'!P:P,'Ark1'!O:O,\"\",0,)","v":""},{"$f":"_xlfn.XLOOKUP(_xlfn.NUMBERVALUE($B9),'Ark1'!R:R,'Ark1'!Q:Q,\"\",0,)","v":""}]
[null,null,null,null,null,null,null,null,null,null,null,null,"","",0,0,"0","0","",null,null,null,null,null,null,null,null,{"$f":"_xlfn.XLOOKUP(_xlfn.NUMBERVALUE($B10),'Ark1'!B:B,'Ark1'!A:A,\"\",0,)","v":""},{"$f":"_xlfn.XLOOKUP(_xlfn.NUMBERVALUE($B10),'Ark1'!D:D,'Ark1'!C:C,\"\",0,)","v":""},{"$f":"_xlfn.XLOOKUP(_xlfn.NUMBERVALUE($B10),'Ark1'!F:F,'Ark1'!E:E,\"\",0,)","v":""},{"$f":"_xlfn.XLOOKUP(_xlfn.NUMBERVALUE($B10),'Ark1'!H:H,'Ark1'!G:G,\"\",0,)","v":""},{"$f":"_xlfn.XLOOKUP(_xlfn.NUMBERVALUE($B10),'Ark1'!J:J,'Ark1'!I:I,\"\",0,)","v":""},{"$f":"_xlfn.XLOOKUP(_xlfn.NUMBERVALUE($B10),'Ark1'!L:L,'Ark1'!K:K,\"\",0,)","v":""},{"$f":"_xlfn.XLOOKUP(_xlfn.NUMBERVALUE($B10),'Ark1'!N:N,'Ark1'!M:M,\"\",0,)","v":""},{"$f":"_xlfn.XLOOKUP(_xlfn.NUMBERVALUE($B10),'Ark1'!P:P,'Ark1'!O:O,\"\",0,)","v":""},{"$f":"_xlfn.XLOOKUP(_xlfn.NUMBERVALUE($B10),'Ark1'!R:R,'Ark1'!Q:Q,\"\",0,)","v":""}]
[null,null,null,null,null,null,null,null,null,null,null,null,"","",0,0,"0","0","",null,null,null,null,null,null,null,null,{"$f":"_xlfn.XLOOKUP(_xlfn.NUMBERVALUE($B11),'Ark1'!B:B,'Ark1'!A:A,\"\",0,)","v":""},{"$f":"_xlfn.XLOOKUP(_xlfn.NUMBERVALUE($B11),'Ark1'!D:D,'Ark1'!C:C,\"\",0,)","v":""},{"$f":"_xlfn.XLOOKUP(_xlfn.NUMBERVALUE($B11),'Ark1'!F:F,'Ark1'!E:E,\"\",0,)","v":""},{"$f":"_xlfn.XLOOKUP(_xlfn.NUMBERVALUE($B11),'Ark1'!H:H,'Ark1'!G:G,\"\",0,)","v":""},{"$f":"_xlfn.XLOOKUP(_xlfn.NUMBERVALUE($B11),'Ark1'!J:J,'Ark1'!I:I,\"\",0,)","v":""},{"$f":"_xlfn.XLOOKUP(_xlfn.NUMBERVALUE($B11),'Ark1'!L:L,'Ark1'!K:K,\"\",0,)","v":""},{"$f":"_xlfn.XLOOKUP(_xlfn.NUMBERVALUE($B11),'Ark1'!N:N,'Ark1'!M:M,\"\",0,)","v":""},{"$f":"_xlfn.XLOOKUP(_xlfn.NUMBERVALUE($B11),'Ark1'!P:P,'Ark1'!O:O,\"\",0,)","v":""},{"$f":"_xlfn.XLOOKUP(_xlfn.NUMBERVALUE($B11),'Ark1'!R:R,'Ark1'!Q:Q,\"\",0,)","v":""}]
[null,null,null,null,null,null,null,null,null,null,null,null,"","",0,0,"0","0","",null,null,null,null,null,null,null,null,{"$f":"_xlfn.XLOOKUP(_xlfn.NUMBERVALUE($B12),'Ark1'!B:B,'Ark1'!A:A,\"\",0,)","v":""},{"$f":"_xlfn.XLOOKUP(_xlfn.NUMBERVALUE($B12),'Ark1'!D:D,'Ark1'!C:C,\"\",0,)","v":""},{"$f":"_xlfn.XLOOKUP(_xlfn.NUMBERVALUE($B12),'Ark1'!F:F,'Ark1'!E:E,\"\",0,)","v":""},{"$f":"_xlfn.XLOOKUP(_xlfn.NUMBERVALUE($B12),'Ark1'!H:H,'Ark1'!G:G,\"\",0,)","v":""},{"$f":"_xlfn.XLOOKUP(_xlfn.NUMBERVALUE($B12),'Ark1'!J:J,'Ark1'!I:I,\"\",0,)","v":""},{"$f":"_xlfn.XLOOKUP(_xlfn.NUMBERVALUE($B12),'Ark1'!L:L,'Ark1'!K:K,\"\",0,)","v":""},{"$f":"_xlfn.XLOOKUP(_xlfn.NUMBERVALUE($B12),'Ark1'!N:N,'Ark1'!M:M,\"\",0,)","v":""},{"$f":"_xlfn.XLOOKUP(_xlfn.NUMBERVALUE($B12),'Ark1'!P:P,'Ark1'!O:O,\"\",0,)","v":""},{"$f":"_xlfn.XLOOKUP(_xlfn.NUMBERVALUE($B12),'Ark1'!R:R,'Ark1'!Q:Q,\"\",0,)","v":""}]
[null,null,null,null,null,null,null,null,null,null,null,null,"","",0,0,"0","0","",null,null,null,null,null,null,null,null,{"$f":"_xlfn.XLOOKUP(_xlfn.NUMBERVALUE($B13),'Ark1'!B:B,'Ark1'!A:A,\"\",0,)","v":""},{"$f":"_xlfn.XLOOKUP(_xlfn.NUMBERVALUE($B13),'Ark1'!D:D,'Ark1'!C:C,\"\",0,)","v":""},{"$f":"_xlfn.XLOOKUP(_xlfn.NUMBERVALUE($B13),'Ark1'!F:F,'Ark1'!E:E,\"\",0,)","v":""},{"$f":"_xlfn.XLOOKUP(_xlfn.NUMBERVALUE($B13),'Ark1'!H:H,'Ark1'!G:G,\"\",0,)","v":""},{"$f":"_xlfn.XLOOKUP(_xlfn.NUMBERVALUE($B13),'Ark1'!J:J,'Ark1'!I:I,\"\",0,)","v":""},{"$f":"_xlfn.XLOOKUP(_xlfn.NUMBERVALUE($B13),'Ark1'!L:L,'Ark1'!K:K,\"\",0,)","v":""},{"$f":"_xlfn.XLOOKUP(_xlfn.NUMBERVALUE($B13),'Ark1'!N:N,'Ark1'!M:M,\"\",0,)","v":""},{"$f":"_xlfn.XLOOKUP(_xlfn.NUMBERVALUE($B13),'Ark1'!P:P,'Ark1'!O:O,\"\",0,)","v":""},{"$f":"_xlfn.XLOOKUP(_xlfn.NUMBERVALUE($B13),'Ark1'!R:R,'Ark1'!Q:Q,\"\",0,)","v":""}]
[null,null,null,null,null,null,null,null,null,null,null,null,"","",0,0,"0","0","",null,null,null,null,null,null,null,null,{"$f":"_xlfn.XLOOKUP(_xlfn.NUMBERVALUE($B14),'Ark1'!B:B,'Ark1'!A:A,\"\",0,)","v":""},{"$f":"_xlfn.XLOOKUP(_xlfn.NUMBERVALUE($B14),'Ark1'!D:D,'Ark1'!C:C,\"\",0,)","v":""},{"$f":"_xlfn.XLOOKUP(_xlfn.NUMBERVALUE($B14),'Ark1'!F:F,'Ark1'!E:E,\"\",0,)","v":""},{"$f":"_xlfn.XLOOKUP(_xlfn.NUMBERVALUE($B14),'Ark1'!H:H,'Ark1'!G:G,\"\",0,)","v":""},{"$f":"_xlfn.XLOOKUP(_xlfn.NUMBERVALUE($B14),'Ark1'!J:J,'Ark1'!I:I,\"\",0,)","v":""},{"$f":"_xlfn.XLOOKUP(_xlfn.NUMBERVALUE($B14),'Ark1'!L:L,'Ark1'!K:K,\"\",0,)","v":""},{"$f":"_xlfn.XLOOKUP(_xlfn.NUMBERVALUE($B14),'Ark1'!N:N,'Ark1'!M:M,\"\",0,)","v":""},{"$f":"_xlfn.XLOOKUP(_xlfn.NUMBERVALUE($B14),'Ark1'!P:P,'Ark1'!O:O,\"\",0,)","v":""},{"$f":"_xlfn.XLOOKUP(_xlfn.NUMBERVALUE($B14),'Ark1'!R:R,'Ark1'!Q:Q,\"\",0,)","v":""}]
[null,null,null,null,null,null,null,null,null,null,null,null,"","",0,0,"0","0","",null,null,null,null,null,null,null,null,{"$f":"_xlfn.XLOOKUP(_xlfn.NUMBERVALUE($B15),'Ark1'!B:B,'Ark1'!A:A,\"\",0,)","v":""},{"$f":"_xlfn.XLOOKUP(_xlfn.NUMBERVALUE($B15),'Ark1'!D:D,'Ark1'!C:C,\"\",0,)","v":""},{"$f":"_xlfn.XLOOKUP(_xlfn.NUMBERVALUE($B15),'Ark1'!F:F,'Ark1'!E:E,\"\",0,)","v":""},{"$f":"_xlfn.XLOOKUP(_xlfn.NUMBERVALUE($B15),'Ark1'!H:H,'Ark1'!G:G,\"\",0,)","v":""},{"$f":"_xlfn.XLOOKUP(_xlfn.NUMBERVALUE($B15),'Ark1'!J:J,'Ark1'!I:I,\"\",0,)","v":""},{"$f":"_xlfn.XLOOKUP(_xlfn.NUMBERVALUE($B15),'Ark1'!L:L,'Ark1'!K:K,\"\",0,)","v":""},{"$f":"_xlfn.XLOOKUP(_xlfn.NUMBERVALUE($B15),'Ark1'!N:N,'Ark1'!M:M,\"\",0,)","v":""},{"$f":"_xlfn.XLOOKUP(_xlfn.NUMBERVALUE($B15),'Ark1'!P:P,'Ark1'!O:O,\"\",0,)","v":""},{"$f":"_xlfn.XLOOKUP(_xlfn.NUMBERVALUE($B15),'Ark1'!R:R,'Ark1'!Q:Q,\"\",0,)","v":""}]
[null,null,null,null,null,null,null,null,null,null,null,null,"","",0,0,"0","0","",null,null,null,null,null,null,null,null,{"$f":"_xlfn.XLOOKUP(_xlfn.NUMBERVALUE($B16),'Ark1'!B:B,'Ark1'!A:A,\"\",0,)","v":""},{"$f":"_xlfn.XLOOKUP(_xlfn.NUMBERVALUE($B16),'Ark1'!D:D,'Ark1'!C:C,\"\",0,)","v":""},{"$f":"_xlfn.XLOOKUP(_xlfn.NUMBERVALUE($B16),'Ark1'!F:F,'Ark1'!E:E,\"\",0,)","v":""},{"$f":"_xlfn.XLOOKUP(_xlfn.NUMBERVALUE($B16),'Ark1'!H:H,'Ark1'!G:G,\"\",0,)","v":""},{"$f":"_xlfn.XLOOKUP(_xlfn.NUMBERVALUE($B16),'Ark1'!J:J,'Ark1'!I:I,\"\",0,)","v":""},{"$f":"_xlfn.XLOOKUP(_xlfn.NUMBERVALUE($B16),'Ark1'!L:L,'Ark1'!K:K,\"\",0,)","v":""},{"$f":"_xlfn.XLOOKUP(_xlfn.NUMBERVALUE($B16),'Ark1'!N:N,'Ark1'!M:M,\"\",0,)","v":""},{"$f":"_xlfn.XLOOKUP(_xlfn.NUMBERVALUE($B16),'Ark1'!P:P,'Ark1'!O:O,\"\",0,)","v":""},{"$f":"_xlfn.XLOOKUP(_xlfn.NUMBERVALUE($B16),'Ark1'!R:R,'Ark1'!Q:Q,\"\",0,)","v":""}]
[null,null,null,null,null,null,null,null,null,null,null,null,"","",0,0,"0","0","",null,null,null,null,null,null,null,null,{"$f":"_xlfn.XLOOKUP(_xlfn.NUMBERVALUE($B17),'Ark1'!B:B,'Ark1'!A:A,\"\",0,)","v":""},{"$f":"_xlfn.XLOOKUP(_xlfn.NUMBERVALUE($B17),'Ark1'!D:D,'Ark1'!C:C,\"\",0,)","v":""},{"$f":"_xlfn.XLOOKUP(_xlfn.NUMBERVALUE($B17),'Ark1'!F:F,'Ark1'!E:E,\"\",0,)","v":""},{"$f":"_xlfn.XLOOKUP(_xlfn.NUMBERVALUE($B17),'Ark1'!H:H,'Ark1'!G:G,\"\",0,)","v":""},{"$f":"_xlfn.XLOOKUP(_xlfn.NUMBERVALUE($B17),'Ark1'!J:J,'Ark1'!I:I,\"\",0,)","v":""},{"$f":"_xlfn.XLOOKUP(_xlfn.NUMBERVALUE($B17),'Ark1'!L:L,'Ark1'!K:K,\"\",0,)","v":""},{"$f":"_xlfn.XLOOKUP(_xlfn.NUMBERVALUE($B17),'Ark1'!N:N,'Ark1'!M:M,\"\",0,)","v":""},{"$f":"_xlfn.XLOOKUP(_xlfn.NUMBERVALUE($B17),'Ark1'!P:P,'Ark1'!O:O,\"\",0,)","v":""},{"$f":"_xlfn.XLOOKUP(_xlfn.NUMBERVALUE($B17),'Ark1'!R:R,'Ark1'!Q:Q,\"\",0,)","v":""}]
[null,null,null,null,null,null,null,null,null,null,null,null,"","",0,0,"0","0","",null,null,null,null,null,null,null,null,{"$f":"_xlfn.XLOOKUP(_xlfn.NUMBERVALUE($B18),'Ark1'!B:B,'Ark1'!A:A,\"\",0,)","v":""},{"$f":"_xlfn.XLOOKUP(_xlfn.NUMBERVALUE($B18),'Ark1'!D:D,'Ark1'!C:C,\"\",0,)","v":""},{"$f":"_xlfn.XLOOKUP(_xlfn.NUMBERVALUE($B18),'Ark1'!F:F,'Ark1'!E:E,\"\",0,)","v":""},{"$f":"_xlfn.XLOOKUP(_xlfn.NUMBERVALUE($B18),'Ark1'!H:H,'Ark1'!G:G,\"\",0,)","v":""},{"$f":"_xlfn.XLOOKUP(_xlfn.NUMBERVALUE($B18),'Ark1'!J:J,'Ark1'!I:I,\"\",0,)","v":""},{"$f":"_xlfn.XLOOKUP(_xlfn.NUMBERVALUE($B18),'Ark1'!L:L,'Ark1'!K:K,\"\",0,)","v":""},{"$f":"_xlfn.XLOOKUP(_xlfn.NUMBERVALUE($B18),'Ark1'!N:N,'Ark1'!M:M,\"\",0,)","v":""},{"$f":"_xlfn.XLOOKUP(_xlfn.NUMBERVALUE($B18),'Ark1'!P:P,'Ark1'!O:O,\"\",0,)","v":""},{"$f":"_xlfn.XLOOKUP(_xlfn.NUMBERVALUE($B18),'Ark1'!R:R,'Ark1'!Q:Q,\"\",0,)","v":""}]
[null,null,null,null,null,null,null,null,null,null,null,null,"","",0,0,"0","0","",null,null,null,null,null,null,null,null,{"$f":"_xlfn.XLOOKUP(_xlfn.NUMBERVALUE($B19),'Ark1'!B:B,'Ark1'!A:A,\"\",0,)","v":""},{"$f":"_xlfn.XLOOKUP(_xlfn.NUMBERVALUE($B19),'Ark1'!D:D,'Ark1'!C:C,\"\",0,)","v":""},{"$f":"_xlfn.XLOOKUP(_xlfn.NUMBERVALUE($B19),'Ark1'!F:F,'Ark1'!E:E,\"\",0,)","v":""},{"$f":"_xlfn.XLOOKUP(_xlfn.NUMBERVALUE($B19),'Ark1'!H:H,'Ark1'!G:G,\"\",0,)","v":""},{"$f":"_xlfn.XLOOKUP(_xlfn.NUMBERVALUE($B19),'Ark1'!J:J,'Ark1'!I:I,\"\",0,)","v":""},{"$f":"_xlfn.XLOOKUP(_xlfn.NUMBERVALUE($B19),'Ark1'!L:L,'Ark1'!K:K,\"\",0,)","v":""},{"$f":"_xlfn.XLOOKUP(_xlfn.NUMBERVALUE($B19),'Ark1'!N:N,'Ark1'!M:M,\"\",0,)","v":""},{"$f":"_xlfn.XLOOKUP(_xlfn.NUMBERVALUE($B19),'Ark1'!P:P,'Ark1'!O:O,\"\",0,)","v":""},{"$f":"_xlfn.XLOOKUP(_xlfn.NUMBERVALUE($B19),'Ark1'!R:R,'Ark1'!Q:Q,\"\",0,)","v":""}]
[null,null,null,null,null,null,null,null,null,null,null,null,"","",0,0,"0","0","",null,null,null,null,null,null,null,null,{"$f":"_xlfn.XLOOKUP(_xlfn.NUMBERVALUE($B20),'Ark1'!B:B,'Ark1'!A:A,\"\",0,)","v":""},{"$f":"_xlfn.XLOOKUP(_xlfn.NUMBERVALUE($B20),'Ark1'!D:D,'Ark1'!C:C,\"\",0,)","v":""},{"$f":"_xlfn.XLOOKUP(_xlfn.NUMBERVALUE($B20),'Ark1'!F:F,'Ark1'!E:E,\"\",0,)","v":""},{"$f":"_xlfn.XLOOKUP(_xlfn.NUMBERVALUE($B20),'Ark1'!H:H,'Ark1'!G:G,\"\",0,)","v":""},{"$f":"_xlfn.XLOOKUP(_xlfn.NUMBERVALUE($B20),'Ark1'!J:J,'Ark1'!I:I,\"\",0,)","v":""},{"$f":"_xlfn.XLOOKUP(_xlfn.NUMBERVALUE($B20),'Ark1'!L:L,'Ark1'!K:K,\"\",0,)","v":""},{"$f":"_xlfn.XLOOKUP(_xlfn.NUMBERVALUE($B20),'Ark1'!N:N,'Ark1'!M:M,\"\",0,)","v":""},{"$f":"_xlfn.XLOOKUP(_xlfn.NUMBERVALUE($B20),'Ark1'!P:P,'Ark1'!O:O,\"\",0,)","v":""},{"$f":"_xlfn.XLOOKUP(_xlfn.NUMBERVALUE($B20),'Ark1'!R:R,'Ark1'!Q:Q,\"\",0,)","v":""}]
{"$rows_left_out":4523}
{"sheet":"Ark1","index":1,"n_rows":24,"n_cols":19,"rows_kept":24,"cut":false,"hidden":true,"merged":[]}
[null,"2.1 Interne Projektindtægter"," ","2.2 Interne Bidrag"," ","2.3 Bidrag Fak/inst"," ","2.4 Intern Handel"," ","2.5 Internt Institut"," ","4.1 Interne Projektomkostninger"," ","4.2 Interne Bidrag"," ","4.3 Bidrag Fak/Inst"," ","4.4 Intern Handel"," "]
["2.1",331050,"2.2",220900,"2.3",220911,"2.4",220951,"2.5",220880,"4.1",431000,"4.2",220800,"4.3",220811,"4.4",220851]
["2.1",331051,"2.2",220901,"2.3",220912,"2.4",220952,"2.5",220881,"4.1",431005,"4.2",220801,"4.3",220812,"4.4",220852]
["2.1",331055,"2.2",220902,"2.3",220913,"2.4",220953,"2.5",220882,"4.1",431007,"4.2",220802,"4.3",220813,"4.4",220853]
["2.1",331057,"2.2",220903,"2.3",220914,"2.4",220954,"2.5",220883,"4.1",431009,"4.2",220803,"4.3",220814,"4.4",220854]
["2.1",331058,"2.2",220904,"2.3",220915,"2.4",220955,"2.5",220884,"4.1",431016,"4.2",220805,"4.3",220815,"4.4",220855]
["2.1",331059,"2.2",220905,"2.3",220916,"2.4",220957,"2.5",220885,"4.1",431020,"4.2",220806,"4.3",220816,"4.4",220856]
["2.1",331066,"2.2",220906,"2.3",220918,"2.4",220958,"2.5",220886,"4.1",431021,"4.2",220807,"4.3",220818,"4.4",220857]
["2.1",331070,"2.2",220907,"2.3",220919,"2.4",220959,"2.5",220887,"4.1",431022,"4.2",220808,"4.3",220819,"4.4",220858]
["2.1",331071,"2.2",220908,"2.3",220920,"2.4",220960,"2.5",220888,"4.1",431023,"4.2",220809,"4.3",220820,"4.4",220860]
["2.1",331072,"2.2",220909,"2.3",220921,"2.4",220961,"2.5",220889,"4.1",431024,"4.2",220810,"4.3",220821,"4.4",220861]
["2.1",331073,"2.2",220910,"2.3",220922,"2.4",220962,"2.5",220890,"4.1",431025,"4.2",220871,"4.3",220822,"4.4",220862]
["2.1",331074,"2.2",220971,"2.3",220923,"2.4",220963,"2.5",220891,"4.1",431051,null,null,"4.3",220823,"4.4",220863]
["2.1",331075,"2.2",220972,"2.3",220924,"2.4",220964,"2.5",220892,"4.1",431055,null,null,"4.3",220824,"4.4",220864]
["2.1",331081,"2.2",220979,"2.3",220925,"2.4",220965,"2.5",220894,"4.1",431058,null,null,"4.3",220825,"4.4",220865]
["2.1",331082,"2.2",220994,"2.3",220926,"2.4",220966,"2.5",220895,"4.1",431081,null,null,"4.3",220826,"4.4",220866]
["2.1",331083,null,null,"2.3",220927,"2.4",220967,null,null,"4.1",431082,null,null,"4.3",220827,"4.4",220867]
["2.1",331084,null,null,"2.3",220929,"2.4",220968,null,null,"4.1",431084,null,null,"4.3",220872,"4.4",220868]
["2.1",331085,null,null,"2.3",220970,"2.4",220975,null,null,"4.1",431085,null,null,"4.3",220873,"4.4",220875]
["2.1",331086,null,null,"2.3",220973,"2.4",220976,null,null,"4.1",431086,null,null,"4.3",220874,"4.4",220876]
{"$rows_left_out":4}